{"text_format":"1","workbook":"xlsx","n_sheets":6,"sheets":["Solicitud","Formato","Ubigeo","DEPARTAMENTO","PROVINCIA","DISTRITO"],"not_rendered":{"charts":0,"images":5,"macros":1,"external_links":0,"defined_names":4,"comments":0,"pivot_tables":0},"unopened":[],"bounds":{"document_bytes":16777216,"sheet_cells":100000,"rows_first":2000,"rows_last":500,"rows_between":2000,"halvings":0,"cell_chars":16384,"cell_head_chars":4096},"cells_cut":0,"cells_raw":0,"read":"whole","date_system":"1900"}

{"sheet":"Solicitud","index":0,"n_rows":99,"n_cols":41,"rows_kept":99,"cut":false,"hidden":false,"merged":[[34,8,34,12],[36,0,36,12],[14,1,14,4],[16,1,16,4],[15,0,15,5],[31,1,31,4],[30,8,30,12],[30,1,30,4],[25,1,25,4],[24,7,24,12],[27,1,27,12],[14,8,14,10],[23,8,23,12],[16,8,16,10],[26,1,26,4],[33,1,33,4],[11,7,11,12],[22,8,22,12],[22,1,22,4],[12,1,12,4],[4,0,4,11],[33,8,33,12],[23,1,23,4],[13,1,13,4],[12,8,12,10],[13,8,13,10],[24,1,24,4],[0,1,0,12],[1,0,1,7],[2,0,2,7],[3,0,3,11],[19,0,19,5],[17,1,17,4],[18,1,18,4],[9,8,9,12],[8,8,8,12],[7,1,7,4],[6,1,6,4],[6,8,6,12],[7,8,7,12],[8,1,8,4],[5,0,5,12],[11,0,11,4]]}
[null,"Programa Delivery de Medicamentos - Programa Tratamiento Complejo\nFormato de Solicitud ",null,null,null,null,null,null,null,null,null,null,null,null,{"$f":"SUM(G7:G9,G13:G15,G17:G19,O7:O10,O13:O17,O23:P23,G23:G27)","v":0},null,null,null,null,null,null,null,null,"Descripción de Clinica","RUC","CódigoIPRESS","CódigoRIPRESS","Tipo Documento","Tipo Plan","Recogio Medicamento","Es solicitud por viaje","Tipo Dirección",null,"Solicitado por",null,"CO_PRODCODE","NO_PRODNAME",null,"CO_ESPECODE","NO_ESPENAME","NUEVOS"]
["Instrucciones para el llenado del formulario.",null,null,null,null,null,null,null,null,null,null,null,null,null,null,null,null,null,null,null,null,null,null,"SELECCIONE CLINICA",null,null,null,"Seleccione","Seleccione","Seleccione","Seleccione","Seleccione",null,"Seleccione",null,0,"Seleccione",null,0,"Seleccione"]
["1. Completar todos los campos obligatorios (marcados con *).",null,null,null,null,null,null,null,null,null,null,null,null,null,null,null,null,null,null,null,null,null,null,"ARBRAYSS LASER","20256347301","00009495","030612C","DNI - Documento Nacional de Identidad","Pacifico EPS","SI","SI","AV.  AVENIDA",null,"Afiliado",null,"CANC","SEGURO ONCOLÓGICO INTERNACIONAL",null,3,"CARDIOLOGIA"]
["2. Una vez completados los campos solicitados, darle click en el boton \"Registrar solicitud\".",null,null,null,null,null,null,null,null,null,null,null,null,null,null,null,null,null,null,null,null,null,null,"AUNA - CLINICA DELGADO","20501781291","00019049","1408279","CARNET EXT. - Carnet de Extranjería","Pacifico SEGUROS","NO","NO","JR.  JIRON",null,"Plataforma Clínica",null,"CANN","SEGURO ONCOLÓGICO NACIONAL",null,5,"CIRUGIA GENERAL","X"]
["3. En caso hubiera campos  incompletos, le mostrará una alerta con el campo que debe completar. Si la solicitud está correctamente completada, le saldrá  el mensaje \"Se ha completado exitosamente el formato de medicamentos\".",null,null,null,null,null,null,null,null,null,null,null,null,null,null,null,null,null,null,null,null,null,null,"AUNA - CLINICA MIRAFLORES","20102756364","00013494","1304686",null,null,null,null,"CAL. CALLE",null,"Broker",null,"MINT","MEDICVIDA INTERNACIONAL",null,11,"DERMATOLOGIA"]
["Datos del Asegurado/Afiliado de acuerdo a su póliza",null,null,null,null,null,null,null,null,null,null,null,null,null,null,null,null,null,null,null,null,null,null,"AUNA - CLINICA SERVIMEDICOS","20394674371","00008229","000292C",null,null,null,null,"PJ.  PASAJE",null,"Comercial",null,"MNAC","MEDICVIDA NACIONAL",null,12,"ENDOCRINOLOGIA"]
["Nombres",null,null,null,null,"*",0,"Compañía de Seguros","Seleccione",null,null,null,null,"*",0,null,null,null,null,null,null,null,null,"CENTRO MEDICO MEDEX","20100339936","00009602","990001C",null,null,null,null,"ALM. ALAMEDA",null,"Otros",null,"MSLD","MULTISALUD",null,13,"GASTROENTEROLOGIA"]
["Apellido Paterno",null,null,null,null,"*",0,null,null,null,null,null,null,null,null,null,null,null,null,{"$f":"IFERROR(INDEX($AJ:$AK,MATCH($I$8,$AK:$AK,0),1),\"\")","v":""},null,null,null,"CENTRO SALUD OFICINA",99999999998,99999998,88888887,null,null,null,null,"MLC. MALECON",null,null,null,"SECO","SEGURO DE SALUD GRUPAL EMPRESAS",null,15,"GERIATRIA","X"]
["Apellido Materno",null,null,null,null,"*",0,"Tipo de Documento de Identidad","Seleccione",null,null,null,null,"*",0,null,null,null,null,null,null,null,null,"CLINICA ANGLOAMERICANA - LA MOLINA","20107695584","00010464","010348C",null,null,null,null,"OVL. OVALO",null,null,null,null,null,null,16,"GINECOLOGIA - OBSTETRICA"]
[null,null,null,null,null,null,null,"Número de Documento",null,null,null,null,null,"*",0,null,null,null,null,null,null,null,null,"CLINICA ANGLOAMERICANA - SAN ISIDRO","20107695584","00009123","980010C",null,null,null,null,"PQ.  PARQUE",null,null,null,null,null,null,17,"GINECOLOGIA ONCOLOGICA","X"]
[null,null,null,null,null,null,null,null,null,null,null,null,null,null,null,null,null,null,null,null,null,null,null,"CLINICA AREQUIPA","20100207941","00013722","000250C",null,null,null,null,"PZA. PLAZA",null,null,null,null,null,null,18,"HEMATOLOGIA","X"]
["Datos de la Clínica y Atención",null,null,null,null,null,null,"Datos de Médico Tratante",null,null,null,null,null,null,null,null,null,null,null,null,null,null,null,"CLINICA CENTENARIO PERUANO JAPONESA","20101267467","00008325","00008325",null,null,null,null,"CAR. CARRETERA",null,null,null,null,null,null,20,"INFECTOLOGIA"]
["Clinica de Atención",null,null,null,null,"*",0,"Apellidos",null,null,null,"*",null,null,0,null,null,null,null,{"$f":"IFERROR(VLOOKUP($B$13,$X:$AA,2,0),\"\")","v":""},{"$f":"IFERROR(VLOOKUP($B$13,$X:$AA,3,0),\"\")","v":""},{"$f":"IFERROR(VLOOKUP($B$13,$X:$AA,4,0),\"\")","v":""},null,"CLINICA DE OJOS D'OPELUCE","20511096279","00015927","1302819",null,null,null,null,"BL.  BLOCK",null,null,null,null,null,null,19,"INMUNOLOGIA Y ALERGIA","X"]
["Fecha Atención (dd/mm/yyyy)",null,null,null,null,"*",0,"Nombres",null,null,null,"*",null,null,0,null,null,null,null,null,null,null,null,"CLINICA DE OJOS OFTALMOVISION","20440460837","00008044","050793C",null,null,null,null,"PRO. PROLONGACIÓN",null,null,null,null,null,null,25,"MEDICINA FISICA Y REHABILITACION"]
["Recogió Medicamento en Clínica ?","Seleccione",null,null,null,"*",0,"CMP",null,null,null,null,null,null,0,null,null,null,null,null,null,null,null,"CLINICA DE OJOS VISUAL CENTER","20507294198","00020976","0020976",null,null,null,null,"PAS. PASEO",null,null,null,null,null,null,26,"MEDICINA GENERAL"]
[null,null,null,null,null,null,null,null,null,null,null,null,null,null,null,null,null,null,null,null,null,null,null,"CLINICA DEL PACIFICO","20103269319","00008750","990089C",null,null,null,null,"PLA. PLAZUELA",null,null,null,null,null,null,28,"MEDICINA INTERNA"]
["Es solicitud por viaje ?","Seleccione",null,null,null,"*",0,"Especialidad de Atención","Seleccione",null,null,"*",null,null,0,null,null,null,null,{"$f":"IFERROR(INDEX($AM:$AN,MATCH($I$17,$AN:$AN,0),1),\"\")","v":0},null,null,null,"CLINICA GOOD HOPE","20337889167","00008746","990086C",null,null,null,null,"POR. PORTAL",null,null,null,null,null,null,32,"NEFROLOGIA"]
["Fecha de Salida (dd/mm/yyyy)",null,null,null,null,"*",0,null,null,null,null,null,null,null,null,null,null,null,null,null,null,null,null,"CLINICA HUANUCO","20228715523","00011592","091039C",null,null,null,null,"OTROS",null,null,null,null,null,null,47,"PEDIATRIA"]
["Fecha de Retorno (dd/mm/yyyy)",null,null,null,null,"*",0,null,null,null,null,null,null,null,null,null,null,null,null,null,null,null,null,"CLINICA INTERNACIONAL - LIMA","20100054184","00015610","980001C",null,null,null,null,null,null,null,null,null,null,null,54,"REUMATOLOGIA"]
[null,null,null,null,null,null,null,null,null,null,null,null,null,null,null,null,null,null,null,null,null,null,null,"CLINICA INTERNACIONAL - SAN BORJA","20100054184","00009682","990004C",null,null,null,null,null,null,null,null,null,null,null,34,"NEUMOLOGIA"]
[null,null,null,null,null,null,null,null,null,null,null,null,null,null,null,null,null,null,null,null,null,null,null,"CLINICA INTERNACIONAL - SURCO","20100054184","00024299","0024299",null,null,null,null,null,null,null,null,null,null,null,35,"NEUROCIRUGIA"]
["Datos del Lugar de Entrega",null,null,null,null,null,null,null,null,null,null,null,null,null,null,null,null,null,null,null,null,null,null,"CLINICA JAVIER PRADO","20100122368","00012633","990002C",null,null,null,null,null,null,null,null,null,null,null,37,"NEUROLOGIA"]
["Tipo Dirección","Seleccione",null,null,null,"*",null,"Dirección",null,null,null,null,null,"*",0,0,null,null,null,null,null,null,null,"CLINICA JESUS DEL NORTE","20517738701","00010182","080947C",null,null,null,null,null,null,null,null,null,null,null,40,"ODONTOLOGIA","X"]
["Nro / Dpto / Interior / Mz / Otros",null,null,null,null,"*",0,"Urbanización / Otros",null,null,null,null,null,null,0,null,null,null,null,null,null,null,null,"CLINICA LIMATAMBO DE CAJAMARCA","20113711834","00009591","990037C",null,null,null,null,null,null,null,null,null,null,null,41,"OFTALMOLOGIA"]
["Departamento",null,null,null,null,"*",0,null,null,null,null,null,null,null,null,null,null,null,null,{"$f":"IFERROR(INDEX(DEPARTAMENTO!$A:$B,MATCH($B$25,DEPARTAMENTO!$B:$B,0),1),\"\")","v":""},null,null,null,"CLINICA LOS FRESNOS","20453503047","00009234","000296C",null,null,null,null,null,null,null,null,null,null,null,42,"ONCOLOGIA MEDICA"]
["Provincia",null,null,null,null,"*",0,null,null,null,null,null,null,null,null,null,null,null,null,{"$f":"IFERROR(INDEX(PROVINCIA!$A:$D,MATCH(($T$25&\".\"&$B$26),PROVINCIA!$D:$D,0),2),\"\")","v":""},null,null,null,"CLINICA MACSALUD","20527956057","00012161","1407661",null,null,null,null,null,null,null,null,null,null,null,44,"OTORRINOLARINGOLOGIA","X"]
["Distrito",null,null,null,null,"*",0,null,null,null,null,null,null,null,null,null,null,null,null,{"$f":"IFERROR(INDEX(DISTRITO!$A:$E,MATCH(($T$25&\".\"&$T$26&\".\"&$B$27),DISTRITO!$E:$E,0),3),\"\")","v":""},{"$f":"($T$25&$T$26&$T$27)","v":""},null,null,"CLINICA MAISON DE SANTE - CHORRILLOS","20101165389","00010251","0010251",null,null,null,null,null,null,null,null,null,null,null,56,"TRAUMATOLOGIA Y ORTOPEDIA"]
["Referencia",null,null,null,null,null,null,null,null,null,null,null,null,null,null,null,null,null,null,null,null,null,null,"CLINICA MAISON DE SANTE - LIMA","20101165389","00008281","0008281",null,null,null,null,null,null,null,null,null,null,null,57,"UROLOGIA"]
[null,null,null,null,null,null,null,null,null,null,null,null,null,null,null,null,null,null,null,null,null,null,null,"CLINICA MAISON DE SANTE - SANTIAGO DE SURO","20101165389","00015118","0015118"]
["Datos de Contacto del Afiliado/Asegurado",null,null,null,null,null,null,null,null,null,null,null,null,null,null,null,null,null,null,null,null,null,null,"CLINICA MEDICA CAYETANO HEREDIA","20515290142","00010603","1302131"]
["Teléfono Celular",null,null,null,null,"*",0,"Correo Electrónico",null,null,null,null,null,"*",0,null,null,null,null,null,null,null,null,"CLINICA MONTEFIORI","20461665820","00009153","1405542"]
["Teléfono Fijo",null,null,null,null,null,0,null,null,null,null,null,null,null,null,null,null,null,null,null,null,null,null,"CLINICA MONTESUR","20110168803","00012219","980012C"]
[null,null,null,null,null,null,null,null,null,null,null,null,null,null,null,null,null,null,null,null,null,null,null,"CLINICA OFTALMOLOGICA FUTURO VISION","20185972179","00011372","990085C"]
["Solicitado por","Seleccione",null,null,null,"*",null,null,null,null,null,null,null,null,null,null,null,null,null,null,null,null,null,"CLINICA ONCOLOGICA ALIADA","20507775889","00008917","040741C"]
[null,null,null,null,null,null,null,null,null,null,null,null,null,null,0,null,null,null,null,null,null,null,null,"CLINICA ORTEGA","20130297685","00008858","1406829"]
[null,null,null,null,null,null,null,null,null,null,null,null,null,null,null,null,null,null,null,null,null,null,null,"CLINICA PARDO","20114868192","00011338","1408659"]
["Condiciones",null,null,null,null,null,null,null,null,null,null,null,null,null,null,null,null,null,null,null,null,null,null,"CLINICA PERUANO AMERICANA","20131914416","00013373","990082C"]
[" 1. Sujeto a condiciones médicas y condiciones de tu póliza / plan de salud.",null,null,null,null,null,null,null,null,null,null,null,null,null,null,null,null,null,null,null,null,null,null,"CLINICA PROMEDIC","20226013696","00015875","1304516"]
["2. Aplica solo en red de clínicas afiliadas al programa (www.pacifico.com.pe)",null,null,null,null,null,null,null,null,null,null,null,null,null,null,null,null,null,null,null,null,null,null,"CLINICA PROVIDENCIA","20477983708","00012666","1100029"]
[null,null,null,null,null,null,null,null,null,null,null,null,null,null,null,null,null,null,null,null,null,null,null,"CLINICA RICARDO PALMA - CHORRILLOS","20512065849","00009868","1301455"]
{"$rows_left_out":60}
{"sheet":"Formato","index":1,"n_rows":1,"n_cols":38,"rows_kept":1,"cut":false,"hidden":true,"merged":[]}
["Tipo_Doc","Num_Documento","ApePaterno","ApeMaterno","Nombres","Tipo_Plan","Clinica_Atencion","Fecha_Atencion","RMedic_Clinica","Apellidos_Medico","Nombres_Medico","Cmp","Solicit_viaje","Fecha_Salida","Fecha_Retorno","Direcion","Interior","urbanizacion","direc_refe","Departamento","Provincia","Distrito","Telefono_Celular","Telefono_Fijo","Correo_Electronico","Ruc_clinica","CódigoIPRESS","CódigoRIPRESS","SolicitadoTipoContacto","SolicitadoNombreContacto","SolicitadoCorreo","Tipo_Direccion","Cod_Prod","Contratante_Producto","Cod_Esp","Especialidad","Cod_ubigeo","Num_Cart_Gar"]

{"sheet":"Ubigeo","index":2,"n_rows":51,"n_cols":8,"rows_kept":51,"cut":false,"hidden":true,"merged":[]}
["Dpto","Prov","Dist",null,null,"Departamento","Provincia","Distrito"]
["Lima","Lima","Lima",null,null,"Lima","Lima","Lima"]
["Lima","Lima","Ancon",null,null,"Prov. Const. del Callao","Prov. Const. del Callao","Ancon"]
["Lima","Lima","Ate",null,null,null,null,"Ate"]
["Lima","Lima","Barranco",null,null,null,null,"Barranco"]
["Lima","Lima","Breña",null,null,null,null,"Breña"]
["Lima","Lima","Carabayllo",null,null,null,null,"Carabayllo"]
["Lima","Lima","Chaclacayo",null,null,null,null,"Chaclacayo"]
["Lima","Lima","Chorrillos",null,null,null,null,"Chorrillos"]
["Lima","Lima","Cieneguilla",null,null,null,null,"Cieneguilla"]
["Lima","Lima","Comas",null,null,null,null,"Comas"]
["Lima","Lima","El Agustino",null,null,null,null,"El Agustino"]
["Lima","Lima","Independencia",null,null,null,null,"Independencia"]
["Lima","Lima","Jesus Maria",null,null,null,null,"Jesus Maria"]
["Lima","Lima","La Molina",null,null,null,null,"La Molina"]
["Lima","Lima","La Victoria",null,null,null,null,"La Victoria"]
["Lima","Lima","Lince",null,null,null,null,"Lince"]
["Lima","Lima","Los Olivos",null,null,null,null,"Los Olivos"]
["Lima","Lima","Lurigancho",null,null,null,null,"Lurigancho"]
["Lima","Lima","Lurin",null,null,null,null,"Lurin"]
["Lima","Lima","Magdalena del Mar",null,null,null,null,"Magdalena del Mar"]
["Lima","Lima","Pueblo Libre (Magdalena Vieja)",null,null,null,null,"Pueblo Libre (Magdalena Vieja)"]
["Lima","Lima","Miraflores",null,null,null,null,"Miraflores"]
["Lima","Lima","Pachacamac",null,null,null,null,"Pachacamac"]
["Lima","Lima","Pucusana",null,null,null,null,"Pucusana"]
["Lima","Lima","Puente Piedra",null,null,null,null,"Puente Piedra"]
["Lima","Lima","Punta Hermosa",null,null,null,null,"Punta Hermosa"]
["Lima","Lima","Punta Negra",null,null,null,null,"Punta Negra"]
["Lima","Lima","Rimac",null,null,null,null,"Rimac"]
["Lima","Lima","San Bartolo",null,null,null,null,"San Bartolo"]
["Lima","Lima","San Borja",null,null,null,null,"San Borja"]
["Lima","Lima","San Isidro",null,null,null,null,"San Isidro"]
["Lima","Lima","San Juan de Lurigancho",null,null,null,null,"San Juan de Lurigancho"]
["Lima","Lima","San Juan de Miraflores",null,null,null,null,"San Juan de Miraflores"]
["Lima","Lima","San Luis",null,null,null,null,"San Luis"]
["Lima","Lima","San Martin de Porres",null,null,null,null,"San Martin de Porres"]
["Lima","Lima","San Miguel",null,null,null,null,"San Miguel"]
["Lima","Lima","Santa Anita",null,null,null,null,"Santa Anita"]
["Lima","Lima","Santa Maria del Mar",null,null,null,null,"Santa Maria del Mar"]
["Lima","Lima","Santa Rosa",null,null,null,null,"Santa Rosa"]
{"$rows_left_out":12}
{"sheet":"DEPARTAMENTO","index":3,"n_rows":26,"n_cols":2,"rows_kept":26,"cut":false,"hidden":true,"merged":[]}
["Codigo","Departamento"]
["01","AMAZONAS"]
["02","ANCASH"]
["03","APURIMAC"]
["04","AREQUIPA"]
["05","AYACUCHO"]
["06","CAJAMARCA"]
["07","CUSCO"]
["08","HUANCAVELICA"]
["09","HUANUCO"]
["10","ICA"]
["11","JUNIN"]
["12","LA LIBERTAD"]
["13","LAMBAYEQUE"]
["14","LIMA"]
["15","LORETO"]
["16","MADRE DE DIOS"]
["17","MOQUEGUA"]
["18","PASCO"]
["19","PIURA"]
["20","PUNO"]
["21","SAN MARTIN"]
["22","TACNA"]
["23","TUMBES"]
["24","CALLAO"]
["25","UCAYALI"]

{"sheet":"PROVINCIA","index":4,"n_rows":197,"n_cols":4,"rows_kept":197,"cut":false,"hidden":true,"merged":[]}
["Cod_dep","Cod_prov","Provincia","Cod_provincia"]
["01","01","CHACHAPOYAS","01.CHACHAPOYAS"]
["01","02","BAGUA","01.BAGUA"]
["01","03","BONGARA","01.BONGARA"]
["01","04","LUYA","01.LUYA"]
["01","05","RODRIGUEZ DE MENDOZA","01.RODRIGUEZ DE MENDOZA"]
["01","06","CONDORCANQUI","01.CONDORCANQUI"]
["01","07","UTCUBAMBA","01.UTCUBAMBA"]
["02","01","HUARAZ","02.HUARAZ"]
["02","02","AIJA","02.AIJA"]
["02","03","BOLOGNESI","02.BOLOGNESI"]
["02","04","CARHUAZ","02.CARHUAZ"]
["02","05","CASMA","02.CASMA"]
["02","06","CORONGO","02.CORONGO"]
["02","07","HUAYLAS","02.HUAYLAS"]
["02","08","HUARI","02.HUARI"]
["02","09","MARISCAL LUZURIAGA","02.MARISCAL LUZURIAGA"]
["02","10","PALLASCA","02.PALLASCA"]
["02","11","POMABAMBA","02.POMABAMBA"]
["02","12","RECUAY","02.RECUAY"]
["02","13","SANTA","02.SANTA"]
["02","14","SIHUAS","02.SIHUAS"]
["02","15","YUNGAY","02.YUNGAY"]
["02","16","ANTONIO RAIMONDI","02.ANTONIO RAIMONDI"]
["02","17","CARLOS FERMIN FITZCARRALD","02.CARLOS FERMIN FITZCARRALD"]
["02","18","ASUNCION","02.ASUNCION"]
["02","19","HUARMEY","02.HUARMEY"]
["02","20","OCROS","02.OCROS"]
["03","01","ABANCAY","03.ABANCAY"]
["03","02","AYMARAES","03.AYMARAES"]
["03","03","ANDAHUAYLAS","03.ANDAHUAYLAS"]
["03","04","ANTABAMBA","03.ANTABAMBA"]
["03","05","COTABAMBAS","03.COTABAMBAS"]
["03","06","GRAU","03.GRAU"]
["03","07","CHINCHEROS","03.CHINCHEROS"]
["04","01","AREQUIPA","04.AREQUIPA"]
["04","02","CAYLLOMA","04.CAYLLOMA"]
["04","03","CAMANA","04.CAMANA"]
["04","04","CARAVELI","04.CARAVELI"]
["04","05","CASTILLA","04.CASTILLA"]
{"$rows_left_out":158}
{"sheet":"DISTRITO","index":5,"n_rows":1844,"n_cols":5,"rows_kept":1844,"cut":false,"hidden":true,"merged":[]}
["Cod_dep","Cod_prov","cod_dist","Distrito","Cod_Ubigeo"]
["01","01","01","CHACHAPOYAS","01.01.CHACHAPOYAS"]
["01","01","02","ASUNCION","01.01.ASUNCION"]
["01","01","03","BALSAS","01.01.BALSAS"]
["01","01","04","CHETO","01.01.CHETO"]
["01","01","05","CHILIQUIN","01.01.CHILIQUIN"]
["01","01","06","CHUQUIBAMBA","01.01.CHUQUIBAMBA"]
["01","01","07","GRANADA","01.01.GRANADA"]
["01","01","08","HUANCAS","01.01.HUANCAS"]
["01","01","09","LA JALCA","01.01.LA JALCA"]
["01","01","10","LEIMEBAMBA","01.01.LEIMEBAMBA"]
["01","01","11","LEVANTO","01.01.LEVANTO"]
["01","01","12","MAGDALENA","01.01.MAGDALENA"]
["01","01","13","MARISCAL CASTILLA","01.01.MARISCAL CASTILLA"]
["01","01","14","MOLINOPAMPA","01.01.MOLINOPAMPA"]
["01","01","15","MONTEVIDEO","01.01.MONTEVIDEO"]
["01","01","16","OLLEROS","01.01.OLLEROS"]
["01","01","17","QUINJALCA","01.01.QUINJALCA"]
["01","01","18","SAN FRANCISCO DE DAGUAS","01.01.SAN FRANCISCO DE DAGUAS"]
["01","01","19","SAN ISIDRO DE MAINO","01.01.SAN ISIDRO DE MAINO"]
["01","01","20","SOLOCO","01.01.SOLOCO"]
["01","01","21","SONCHE","01.01.SONCHE"]
["01","02","01","LA PECA","01.02.LA PECA"]
["01","02","02","ARAMANGO","01.02.ARAMANGO"]
["01","02","03","COPALLIN","01.02.COPALLIN"]
["01","02","04","EL PARCO","01.02.EL PARCO"]
["01","02","05","BAGUA","01.02.BAGUA"]
["01","02","06","IMAZA","01.02.IMAZA"]
["01","03","01","JUMBILLA","01.03.JUMBILLA"]
["01","03","02","COROSHA","01.03.COROSHA"]
["01","03","03","CUISPES","01.03.CUISPES"]
["01","03","04","CHISQUILLA","01.03.CHISQUILLA"]
["01","03","05","CHURUJA","01.03.CHURUJA"]
["01","03","06","FLORIDA","01.03.FLORIDA"]
["01","03","07","RECTA","01.03.RECTA"]
["01","03","08","SAN CARLOS","01.03.SAN CARLOS"]
["01","03","09","SHIPASBAMBA","01.03.SHIPASBAMBA"]
["01","03","10","VALERA","01.03.VALERA"]
["01","03","11","YAMBRASBAMBA","01.03.YAMBRASBAMBA"]
["01","03","12","JAZAN","01.03.JAZAN"]
{"$rows_left_out":1804}